{"text_format":"1","workbook":"xlsx","n_sheets":9,"sheets":["Formularz","Wyjaśnienia","Inf","Charakterystyka","Tabele","Form_zkzl","Form_zdm","jednostki organizacyjne","legenda"],"not_rendered":{"charts":0,"images":1,"macros":1,"external_links":0,"defined_names":1,"comments":0,"pivot_tables":0},"unopened":[],"bounds":{"document_bytes":16777216,"sheet_cells":100000,"rows_first":2000,"rows_last":500,"rows_between":2000,"halvings":0,"cell_chars":16384,"cell_head_chars":4096},"cells_cut":0,"cells_raw":0,"read":"whole","date_system":"1900"}

{"sheet":"Formularz","index":0,"n_rows":75,"n_cols":11,"rows_kept":75,"cut":false,"hidden":false,"merged":[[73,0,73,10],[69,0,69,2],[56,0,56,2],[57,0,57,2],[59,0,59,2],[60,0,60,2],[60,3,60,10],[63,0,63,10],[52,0,52,2],[53,0,53,2],[52,3,52,10],[53,3,53,10],[54,0,54,2],[55,0,55,2],[54,3,54,10],[55,3,55,10],[48,0,48,2],[49,0,49,2],[48,3,48,10],[49,3,49,10],[50,0,50,2],[51,0,51,2],[50,3,50,10],[51,3,51,10],[34,0,34,10],[43,0,44,2],[43,3,44,6],[45,0,45,2],[45,3,47,6],[46,0,46,2],[47,0,47,2],[35,0,35,10],[39,0,39,10],[40,0,40,10],[28,5,28,6],[28,7,28,8],[32,0,32,3],[31,0,31,2],[31,3,31,6],[31,7,31,9],[30,0,30,2],[26,0,26,2],[27,0,27,2],[27,3,27,4],[28,0,28,2],[26,3,26,4],[28,3,28,4],[27,7,27,8],[22,7,22,8],[19,5,19,6],[21,5,21,6],[20,5,20,6],[19,7,19,8],[20,7,20,8],[27,5,27,6],[21,7,21,8],[22,5,22,6],[23,5,23,6],[23,7,23,8],[26,5,26,6],[24,5,24,6],[25,7,25,8],[25,5,25,6],[24,7,24,8],[26,7,26,8],[24,3,24,4],[25,3,25,4],[21,3,21,4],[21,0,21,2],[22,0,22,2],[22,3,22,4],[24,0,24,2],[25,0,25,2],[23,0,23,2],[23,3,23,4],[18,3,18,4],[18,5,18,6],[18,0,18,2],[20,0,20,2],[20,3,20,4],[19,0,19,2],[19,3,19,4],[18,7,18,8],[13,7,13,8],[16,7,16,8],[17,0,17,2],[16,0,16,2],[14,7,14,8],[16,5,16,6],[17,3,17,4],[17,5,17,6],[17,7,17,8],[16,3,16,4],[2,0,2,10],[15,5,15,6],[15,0,15,2],[13,0,13,2],[13,3,13,4],[13,5,13,6],[14,0,14,2],[14,3,14,4],[14,5,14,6],[15,3,15,4],[12,0,12,2],[12,3,12,4],[12,5,12,6],[15,7,15,8],[11,7,11,8],[11,0,11,2],[11,3,11,4],[11,5,11,6],[6,0,7,2],[8,0,8,2],[8,3,10,6],[9,0,9,2],[10,0,10,2],[43,7,47,10],[56,3,56,10],[57,3,57,10],[59,3,59,10],[3,0,3,10],[6,3,6,6],[6,7,10,10],[30,3,30,6],[30,7,30,10],[12,7,12,8],[74,0,74,10],[61,3,61,10],[69,3,69,6],[69,7,69,10],[61,0,61,2],[71,0,71,3],[70,0,70,2],[70,3,70,6],[70,7,70,10],[71,7,71,10]]}
[]
[]
["INFORMACJA O STANIE MIENIA KOMUNALNEGO"]
["MIASTA POZNANIA NA DZIEŃ 31 GRUDNIA 2008 R."]
["Tab. nr 1"]
["Pozostałe jednostki organizacyjne",null,null,null,null,null,null,"Nr KSAT :",{"$f":"VLOOKUP(Inf!E1,ik,5)","v":491}]
["Nazwa i adres jednostki sprawozdawczej - pieczęć",null,null,"AKTYWA TRWAŁE",null,null,null,"Urząd Miasta Poznania \nWydział Gospodarki Nieruchomościami\nul. Gronowa 20\n61-655 Poznań"]
[]
[{"$f":"VLOOKUP(Inf!E1,ik,2)","v":"Estrada Poznańska"},null,null,"(wartość składników majątkowych będących własnością Miasta Poznania, na stanie miejskich jednostek organizacyjnych i komunalnych osób prawnych)"]
[{"$f":"VLOOKUP(Inf!E1,ik,3)","v":"ul. Masztalarska 8"}]
[{"$f":"VLOOKUP(Inf!E1,ik,4)","v":"61-767 Poznań"}]
["Nazwa i symbol klasyfikacji rodzajowej",null,null,"Wartość brutto \n(w zł)",null,"Wartość umorzenia \n(w zł)",null,"Wartość netto \n(w zł)",null,"Ilość","Jm"]
["Grunty \n(konto 011 - gr. 0)",null,null,1137239,null,0,null,{"$f":"D13-F13","v":1137239},null,1,"dz."]
["Budynki i lokale \n(konto 011 - gr. 1)",null,null,2704372,null,2121413,null,{"$f":"D14-F14","v":582959},null,1,"szt."]
["Obiekty inżynierii lądowej \ni wodnej (konto 011 - gr. 2)",null,null,null,null,null,null,0,null,0,"szt."]
["Maszyny i urządzenia techniczne \n(konto 011 - gr. 3-6)",null,null,558294,null,458376,null,99918,null,1,"szt."]
["Środki transportu \n(konto 011 - gr. 7)",null,null,null,null,null,null,0,null,null,"szt."]
["Narzędzia, przyrządy, ruchomości \ni wyposażenie (konto 011 - gr. 8)",null,null,195115,null,158763,null,36352]
["Inwentarz żywy \n(konto 011 - gr. 9)",null,null,null,null,null,null,0]
["Pozostałe środki trwałe \n(konto 013)",null,null,null,null,{"$f":"D20","v":0},null,0]
["Zbiory biblioteczne                        (konto 014)",null,null,null,null,{"$f":"D21","v":0},null,0]
["Mienie zlikwidowanych jednostek \n(konto 015)",null,null,null,null,null,null,{"$f":"D22-F22","v":0}]
["Dobra kultury \n(konto 016)",null,null,null,null,0,null,{"$f":"D23-F23","v":0}]
["Uzbrojenie i sprzęt wojskowy\n(konto 017)",null,null,null,null,null,null,0]
["Wartości niematerialne i prawne (konto 020)",null,null,49358,null,35420,null,13938]
["Długoterminowe aktywa finansowe      (konto 030)",null,null,0,null,0,null,0]
["Inwestycje - środki trwałe w budowie        (konto 080,081,082,083)",null,null,null,null,0,null,{"$f":"D27-F27","v":0}]
["Należności długoterminowe\n(konto 226)",null,null,null,null,0,null,0]
["AKTYWA TRWAŁE RAZEM",null,null,{"$f":"SUM(D13:E28)","v":4644378},null,{"$f":"SUM(F13:G28)","v":2773972},null,{"$f":"SUM(H13:I28)","v":1870406}]
[]
{"$rows_left_out":46}
{"sheet":"Wyjaśnienia","index":1,"n_rows":26,"n_cols":4,"rows_kept":26,"cut":false,"hidden":false,"merged":[[1,3,3,3],[24,1,24,2],[23,1,23,2],[0,1,0,2],[1,1,3,2]]}
["Nazwa i adres jednostki sprawozdawczej\n(wraz z pieczecią)","Informacja o stanie mienia komunalnego\nMiasta Poznania na dzień 00-01-1900 r.",null,"Urząd Miasta Poznania"]
[null,"WYJAŚNIENIA ZMIAN WARTOŚCI MAJĄTKU\n(Aktywa trwałe)",null,"Wydział Gospodarki Nieruchomościami\nul. Gronowa 20\n61-655 Poznań"]
[]
[]
["Wyszczególnienie","Wartość brutto\nwg stanu na\n31-12-2007 r. [w zł]","Wartość brutto\nwg stanu na\n31-12-2008 r. [w zł]","Wyjaśnienia zmian (zmniejszenia, zwiększenia)"]
["Grunty\n(konto 011 - grupa 0)"]
["Budynki i lokale\n(konto 011 - grupa 1)"]
["Obiekty inżynierii lądowej i wodnej\n(konto 011 - grupa 2)"]
["Maszyny i urządzenia techniczne\n(konto 011 - grupa 3 do 6)"]
["Środki transportu\n(konto 011 - grupa 7)"]
["Narzedzia, przyrządy, ruchomości\ni wyposażenie (konto 011 - grupa 8)"]
["Inwentarz żywy\n(konto 011 - grupa 9)"]
["Pozostałe środki trwałe\n(konto 013)"]
["Zbiory biblioteczne\n(konto 014)"]
["Mienie zlikwidowanych jednostek\n(konto 015)"]
["Dobra kultury\n(konto 016)"]
["Uzbrojenie i sprzęt wojskowy\n(konto 017)"]
["Wartości niematerialne i prawne\n(konto 020)"]
["Długoterminowe aktywa finansowe\n(konto 030)"]
["Inwestycje - środki trwałe w budowie\n(konto 080)"]
["Należności długoterminowe\n(konto 226)"]
["R A Z E M",{"$f":"SUM(B6:B21)","v":0},{"$f":"SUM(C6:C21)","v":0}]
[]
["a","a 30-06-2006",null,"a"]
["Nr telefonu, pod którym można uzyskać","Sporządził dnia",null,"Pieczątka imienna i podpis osoby"]
["wyjaśnienia dotyczące sprawozdania",null,null,"działającej w imieniu sprawozdawcy"]

{"sheet":"Inf","index":2,"n_rows":39,"n_cols":8,"rows_kept":39,"cut":false,"hidden":true,"merged":[]}
["Data sprawozdania:","31-12-2008",null,"Łącze :",1,"Uwagi uzupełniające do ankiety"]
["Mienie użyczone","N",null,false,false]
["Ogród zoologiczny","N",null,false,false]
["ZKZL ankieta dodatkowa","N",null,false,false]
["ZDM ankieta dodatkowa","N",null,false,false]
["ZKZL\nCharakterystyka\nkomunalnego \nzasobu lokalowego","N",null,false,false]
["Jednostka organizacyjna ",{"$f":"VLOOKUP(Inf!E1,ik,5)","v":491},null,false,false]
["Sporządził","Grażyna Jabłońska",null,null,false]
["Telefon kontaktowy","061 8528833"]
["Kierownik","Tomasz Karczewski"]
["Data sporządzenia","30-05-2009"]
["Jednostka pełni zadania powiatu","Nie"]
[]
["Klasyfikacja rodzajowa"]
["Kod Ksatowski","Nazwa elementu listy","Brutto","Umorzenie","Netto","Wyjaśnienie zmian","Ilość","Jm"]
["GRU","Grunty",0,0,0,null,0,"dz."]
["B","Budynki i lokale",0,0,0,null,0,"szt."]
["OI","Obiekty inżynierii lądowej i wodnej",0,0,0,null,0,"szt."]
["MU","Maszyny i urządzenia techniczne",0,0,0,null,0,"szt."]
["ST","Środki transportu",0,0,0,null,0,"szt."]
["NPW","Narzędzia, przyrządy, ruchomości\ni wyposażenie",0,0,0,null,0]
["INW","Inwentarz żywy",0,0,0,null,0]
["PST","Pozostałe środki trwałe",0,0,0,null,0]
["ZB","Zbiory biblioteczne",0,0,0,null,0]
["MZJ","Mienie zlikwidowanych jednostek",0,0,0,null,0]
["DK","Dobra kultury",0,0,0,null,0]
["USW","Uzbrojenie i sprzęt wojskowy",0,0,0,null,0]
["WNP","Wartości niematerialne i prawne",0,0,0,null,0]
["DAF","Długoterminowe aktywa finansowe",0,0,0,null,0]
["STB","Inwestycje - środki trwałe w budowie",0,0,0,null,0]
{"$rows_left_out":10}
{"sheet":"Charakterystyka","index":3,"n_rows":15,"n_cols":7,"rows_kept":15,"cut":false,"hidden":true,"merged":[[3,0,3,1],[4,0,4,1],[7,0,7,1],[5,0,6,0],[14,5,14,6],[12,2,12,4],[13,2,13,4],[14,0,14,1],[0,5,0,6],[1,5,1,6],[12,0,12,1],[13,0,13,1],[12,5,12,6],[13,5,13,6],[0,0,0,1],[1,0,1,1],[0,2,0,4],[1,2,1,4]]}
["Nazwa i adres jednostki sprawozdawczej\n(wraz z pieczecią)",null,"Informacja o stanie mienia komunalnego\nMiasta Poznania na dzień \n2008-12-31 r.",null,null,"Urząd Miasta Poznania"]
["Zarząd Komunalnych Zasobów Lokalowych\nPl. Kolegiacki 17\n61-841 Poznań",null,"CHARAKTERYSTYKA\nKOMUNALNEGO ZASOBU LOKALOWEGO",null,null,"Wydział Mienia Komunalnego\nul. Gronowa 20\n61-655 Poznań"]
[]
["Wyszczególnienie",null,"Ilość budynków","Ilość lokali\nmieszkalnych","Ilość lokali\nużytkowych","Powierzchnia lokali\nmieszkalnych [m²]","Powierzchnia lokali\nużytkowych [m²]"]
["Budynki komunalne"]
["Budynki wspólnot\nmieszkaniowych","z większościowym\nudziałem gminy"]
[null,"z mniejszościowym\nudziałem gminy"]
["Ogółem",null,{"$f":"SUM(C5:C7)","v":0},{"$f":"SUM(D5:D7)","v":0},{"$f":"SUM(E5:E7)","v":0},{"$f":"SUM(F5:F7)","v":0},{"$f":"SUM(G5:G7)","v":0}]
[]
[]
[]
[]
[]
["Nr telefonu, pod którym można uzyskać",null,"Sporządził dnia",null,null,"Pieczątka imienna i podpis osoby"]
["wyjaśnienia dotyczące sprawozdania",null,null,null,null,"działającej w imieniu sprawozdawcy"]

{"sheet":"Tabele","index":4,"n_rows":75,"n_cols":11,"rows_kept":75,"cut":false,"hidden":true,"merged":[[57,0,57,2],[56,3,56,10],[71,7,71,10],[61,0,61,2],[60,0,60,2],[59,0,59,2],[20,0,20,2],[50,0,50,2],[49,0,49,2],[26,0,26,2],[21,0,21,2],[27,0,27,2],[28,0,28,2],[30,0,30,2],[14,0,14,2],[15,0,15,2],[16,0,16,2],[17,0,17,2],[18,0,18,2],[19,0,19,2],[26,3,26,4],[26,5,26,6],[26,7,26,8],[22,0,22,2],[22,3,22,4],[22,5,22,6],[22,7,22,8],[25,7,25,8],[23,0,23,2],[23,3,23,4],[17,5,17,6],[17,3,17,4],[17,7,17,8],[18,3,18,4],[18,7,18,8],[20,3,20,4],[19,3,19,4],[20,5,20,6],[20,7,20,8],[23,7,23,8],[23,5,23,6],[21,3,21,4],[21,5,21,6],[21,7,21,8],[14,3,14,4],[15,3,15,4],[15,5,15,6],[16,3,16,4],[16,5,16,6],[14,5,14,6],[11,3,11,4],[11,5,11,6],[12,3,12,4],[12,5,12,6],[12,0,12,2],[13,0,13,2],[24,7,24,8],[6,0,7,2],[8,0,8,2],[8,3,10,6],[10,0,10,2],[9,0,9,2],[6,3,6,6],[13,3,13,4],[13,5,13,6],[11,0,11,2],[25,0,25,2],[25,3,25,4],[25,5,25,6],[24,0,24,2],[24,3,24,4],[24,5,24,6],[35,0,35,10],[39,0,39,10],[27,3,27,4],[27,5,27,6],[27,7,27,8],[28,3,28,4],[28,7,28,8],[28,5,28,6],[57,3,57,10],[59,3,59,10],[51,3,51,10],[52,3,52,10],[53,3,53,10],[54,3,54,10],[2,0,2,10],[3,0,3,10],[55,3,55,10],[11,7,11,8],[12,7,12,8],[13,7,13,8],[14,7,14,8],[15,7,15,8],[16,7,16,8],[30,3,30,6],[31,0,31,2],[31,3,31,6],[31,7,31,9],[34,0,34,10],[32,0,32,3],[6,7,10,10],[30,7,30,10],[19,5,19,6],[19,7,19,8],[18,5,18,6],[40,0,40,10],[70,3,70,6],[46,0,46,2],[43,7,47,10],[48,3,48,10],[49,3,49,10],[47,0,47,2],[45,3,47,6],[48,0,48,2],[43,0,44,2],[43,3,44,6],[63,0,63,10],[50,3,50,10],[45,0,45,2],[52,0,52,2],[51,0,51,2],[54,0,54,2],[53,0,53,2],[56,0,56,2],[55,0,55,2],[74,0,74,10],[60,3,60,10],[61,3,61,10],[69,0,69,2],[70,0,70,2],[69,3,69,6],[69,7,69,10],[70,7,70,10],[73,0,73,10],[71,0,71,3]]}
[]
[]
["INFORMACJA O STANIE MIENIA KOMUNALNEGO"]
["MIASTA POZNANIA NA DZIEŃ 31 GRUDNIA 2008 R."]
["Tab. nr 1"]
[null,null,null,null,null,null,null,"Nr KSAT :"]
["Nazwa i adres jednostki sprawozdawczej - pieczęć",null,null,"AKTYWA TRWAŁE",null,null,null,"Urząd Miasta Poznania \nWydział Gospodarki Nieruchomościami\nul. Gronowa 20\n61-655 Poznań"]
[]
[null,null,null,"(wartość składników majątkowych będących własnością Miasta Poznania, na stanie miejskich jednostek organizacyjnych i komunalnych osób prawnych)"]
[]
[]
["Nazwa i symbol klasyfikacji rodzajowej",null,null,"Wartość brutto \n(w zł)",null,"Wartość umorzenia \n(w zł)",null,"Wartość netto \n(w zł)",null,"Ilość","Jm"]
["Grunty \n(konto 011 - gr. 0)",null,null,null,null,null,null,{"$f":"D13-F13","v":0},null,null,"dz."]
["Budynki i lokale \n(konto 011 - gr. 1)",null,null,null,null,null,null,{"$f":"D14-F14","v":0},null,null,"szt."]
["Obiekty inżynierii lądowej \ni wodnej (konto 011 - gr. 2)",null,null,null,null,null,null,0,null,null,"szt."]
["Maszyny i urządzenia techniczne \n(konto 011 - gr. 3-6)",null,null,null,null,null,null,0,null,null,"szt."]
["Środki transportu \n(konto 011 - gr. 7)",null,null,null,null,null,null,0,null,null,"szt."]
["Narzędzia, przyrządy, ruchomości \ni wyposażenie (konto 011 - gr. 8)",null,null,null,null,null,null,0]
["Inwentarz żywy \n(konto 011 - gr. 9)",null,null,null,null,null,null,0]
["Pozostałe środki trwałe \n(konto 013)",null,null,null,null,{"$f":"D20","v":0},null,{"$f":"D20-F20","v":0}]
["Zbiory biblioteczne                        (konto 014)",null,null,null,null,{"$f":"D21","v":0},null,0]
["Mienie zlikwidowanych jednostek \n(konto 015)",null,null,null,null,null,null,{"$f":"D22-F22","v":0}]
["Dobra kultury \n(konto 016)",null,null,null,null,0,null,{"$f":"D23-F23","v":0}]
["Uzbrojenie i sprzęt wojskowy\n(konto 017)",null,null,null,null,null,null,0]
["Wartości niematerialne i prawne (konto 020)",null,null,null,null,null,null,0]
["Długoterminowe aktywa finansowe      (konto 030)",null,null,null,null,0,null,0]
["Inwestycje - środki trwałe w budowie        (konto 080,081,082,083)",null,null,null,null,0,null,{"$f":"D27-F27","v":0}]
["Należności długoterminowe\n(konto 226)",null,null,null,null,0,null,0]
["AKTYWA TRWAŁE RAZEM",null,null,{"$f":"SUM(D13:E28)","v":0},null,{"$f":"SUM(F13:G28)","v":0},null,{"$f":"SUM(H13:I28)","v":0}]
[]
{"$rows_left_out":46}
{"sheet":"Form_zkzl","index":5,"n_rows":41,"n_cols":8,"rows_kept":41,"cut":false,"hidden":true,"merged":[[37,6,37,8],[31,0,31,2],[31,3,31,4],[31,5,31,6],[31,7,31,8],[39,0,39,8],[40,0,40,8],[36,0,36,2],[36,3,36,5],[36,6,36,8],[37,0,37,2],[29,0,29,2],[29,3,29,4],[29,5,29,6],[29,7,29,8],[30,0,30,2],[30,3,30,4],[30,5,30,6],[30,7,30,8],[26,0,26,8],[27,0,27,8],[28,0,28,2],[28,3,28,4],[28,5,28,6],[28,7,28,8],[11,5,11,6],[11,7,11,8],[12,7,12,8],[12,0,12,2],[12,3,12,4],[12,5,12,6],[11,0,11,2],[11,3,11,4],[18,0,18,8],[20,0,20,2],[20,3,20,4],[20,5,20,6],[20,7,20,8],[19,0,19,8],[9,5,9,6],[9,7,9,8],[10,3,10,4],[10,5,10,6],[10,7,10,8],[9,0,9,2],[10,0,10,2],[9,3,9,4],[0,0,0,8],[1,0,1,8],[4,0,5,2],[4,7,8,8],[6,0,6,2],[7,0,7,2],[4,3,8,6],[8,0,8,2],[32,0,32,2],[32,3,32,4],[32,5,32,6],[32,7,32,8],[35,0,35,2],[35,3,35,5],[35,6,35,8],[23,0,23,2],[23,3,23,4],[23,5,23,6],[23,7,23,8],[24,0,24,2],[24,3,24,4],[24,5,24,6],[24,7,24,8],[21,0,21,2],[21,3,21,4],[21,5,21,6],[21,7,21,8],[22,0,22,2],[22,3,22,4],[22,5,22,6],[22,7,22,8],[15,0,15,2],[15,3,15,4],[15,5,15,6],[15,7,15,8],[16,0,16,2],[16,3,16,4],[16,5,16,6],[16,7,16,8],[13,5,13,6],[13,7,13,8],[14,0,14,2],[14,3,14,4],[14,5,14,6],[14,7,14,8],[13,0,13,2],[13,3,13,4]]}
["INFORMACJA O STANIE MIENIA KOMUNALNEGO"]
["MIASTA POZNANIA NA DZIEŃ 31 GRUDNIA 2008 R."]
[]
[]
["Nazwa i adres jednostki sprawozdawczej - pieczęć",null,null,"BUDYNKI KOMUNALNE",null,null,null,"Urząd Miasta Poznania \nWydział Mienia \nKomunalnego\nul. Gronowa 20\n61-655 Poznań"]
[]
["Zarząd Komunalnych Zasobów Lokalowych"]
["Pl. Kolegiacki 17"]
["61-841 Poznań"]
["Nazwa i symbol klasyfikacji rodzajowej",null,null,"Wartość brutto środków trwałych (w zł)",null,"Wartość umorzenia środków trwałych (w zł)",null,"Wartość netto środków trwałych  (w zł)"]
["Budynki i lokale (gr. 1)",null,null,null,null,null,null,{"$f":"D11-F11","v":0}]
["w użyczeniu",null,null,null,null,null,null,0]
["spółdzielcze własnościowe \nprawo do lokalu",null,null,null,null,null,null,0]
["Obiekty inżynierii lądowej \ni wodnej (gr. 2)",null,null,null,null,null,null,0]
["Maszyny i urządzenia techniczne \n(gr. 3-6)",null,null,null,null,null,null,0]
["Narzędzia, przyrządy, ruchomości i wyposażenie (gr. 8)",null,null,null,null,null,null,0]
["RAZEM",null,null,{"$f":"SUM(D11:E16)","v":0},null,{"$f":"SUM(F11:G16)","v":0},null,{"$f":"SUM(H11:I16)","v":0}]
[]
["BUDYNKI WSPÓLNOT MIESZKANIOWYCH"]
["(będących udziałem Miasta Poznania)"]
["Budynki i lokale (gr. 1)",null,null,null,null,null,null,{"$f":"D21-F21","v":0}]
["Obiekty inżynierii lądowej \ni wodnej (gr. 2)",null,null,null,null,null,null,{"$f":"D22-F22","v":0}]
["Maszyny i urządzenia techniczne \n(gr. 3-6)",null,null,null,null,null,null,{"$f":"D23-F23","v":0}]
["Narzędzia, przyrządy, ruchomości \ni wyposażenie (gr. 8)",null,null,null,null,null,null,{"$f":"D24-F24","v":0}]
["RAZEM",null,null,{"$f":"SUM(D21:E24)","v":0},null,{"$f":"SUM(F21:G24)","v":0},null,{"$f":"SUM(H21:I24)","v":0}]
[]
["WSPÓŁWŁASNOŚCI"]
["(będące udziałem Miasta Poznania)"]
["Budynki i lokale (gr. 1)",null,null,null,null,null,null,{"$f":"D29-F29","v":0}]
["Obiekty inżynierii lądowej \ni wodnej (gr. 2)",null,null,null,null,null,null,{"$f":"D30-F30","v":0}]
{"$rows_left_out":12}
{"sheet":"Form_zdm","index":6,"n_rows":41,"n_cols":9,"rows_kept":41,"cut":false,"hidden":true,"merged":[[25,7,25,8],[34,0,34,2],[36,0,36,2],[34,3,34,5],[34,6,34,8],[35,0,35,2],[35,3,35,5],[35,6,35,8],[23,1,23,2],[23,3,23,4],[23,7,23,8],[39,0,39,8],[40,0,40,8],[24,1,24,2],[24,3,24,4],[24,7,24,8],[25,1,25,2],[25,3,25,4],[21,1,21,2],[21,3,21,4],[21,7,21,8],[22,1,22,2],[22,3,22,4],[22,7,22,8],[14,0,14,1],[19,1,20,2],[19,3,20,4],[19,5,19,6],[17,3,17,4],[19,7,20,8],[0,0,0,8],[1,0,1,8],[7,0,8,0],[7,1,8,1],[5,3,5,4],[7,2,7,3],[7,4,7,5],[7,6,7,8]]}
["INFORMACJA O STANIE MIENIA KOMUNALNEGO"]
["MIASTA POZNANIA NA DZIEŃ 31 GRUDNIA 2008 R."]
[]
[]
[null,"Tab.3.","Charakterystyka dróg administrowanych przez Zarząd Dróg Miejskich w Poznaniu"]
[null,null,"wg stanu na","2008-12-31 r."]
[]
["Lp.","Dzielnica","Powierzchnia (m²)",null,"Długość (mb)",null,"W tym drogi gminne i powiatowe (mb)"]
[null,null,"drogi gminne i powiatowe","pozostałe","drogi gminne i powiatowe","pozostałe","oświet-lone","nawierzchnia twarda","nawierzchnia gruntowa"]
[1,"Stare Miasto"]
[2,"Nowe Miasto"]
[3,"Wilda"]
[4,"Jeżyce"]
[5,"Grunwald"]
["Razem",null,{"$f":"SUM(C10:C14)","v":0},0,0,0,0,0,0]
[]
[null,"Tab.4.","Wartość dróg administrowanych przez Zarząd Dróg Miejskich w Poznaniu"]
[null,null,"wg stanu na","2008-12-31 r. (w zł)."]
[]
[null,"Kategoria dróg",null,"Wartość brutto",null,"Wartość umorzenia",null,"Wartość netto"]
[null,null,null,null,null,"[zł]","%"]
[null,"Wartość dróg w ewidencji bilansowej w tym :",null,null,null,null,{"$f":"IF(D22=\"\",\"\",100*F22/D22)","v":""},{"$f":"D22-F22","v":0}]
[null,"Drogi gminne",null,null,null,null,{"$f":"IF(D23=\"\",\"\",100*F23/D23)","v":""},{"$f":"D23-F23","v":0}]
[null,"Drogi powiatowe",null,null,null,null,{"$f":"IF(D24=\"\",\"\",100*F24/D24)","v":""},{"$f":"D24-F24","v":0}]
[null,"Wartość dróg w ewidencji pozabilansowej",null,null,null,null,{"$f":"IF(D25=\"\",\"\",100*F25/D25)","v":""},{"$f":"D25-F25","v":0}]
[null,"Razem",null,{"$f":"SUM(D22,D25)","v":0},null,{"$f":"SUM(F22,F25)","v":0},{"$f":"IF(D26=0,\"\",100*F26/D26)","v":""},{"$f":"D26-F26","v":0}]
[]
[]
[]
[]
{"$rows_left_out":12}
{"sheet":"jednostki organizacyjne","index":7,"n_rows":376,"n_cols":13,"rows_kept":376,"cut":false,"hidden":true,"merged":[]}
["Id","Nazwa ","Adres1","Adres 2","Ksat","Kod1","Kod2","Kod3",null,"Nr KSAT","Nazwa MJO","Adres MJO","Adres2 MJO"]
[null,"Straż Miejska Miasta Poznania","Plac Kolegiacki 17","61-841 Poznań",34892,0,0,null,null,498,"Biblioteka Raczyńskich","Plac Wolności 19","61-739 Poznań"]
[null,"Zarząd Dróg Miejskich","ul. Wilczak 16","61-623 Poznań",428,0,1,null,null,493,"Centrum Kultury Zamek","ul. Św. Marcin 80/82","61-809 Poznań"]
[null,"Zarząd Komunalnych Zasobów Lokalowych","ul. Matejki 57","60-770 Poznań",429,0,2,null,null,497,"Centrum Sztuki Dziecka w Poznaniu","ul. Św. Marcin 80/82","61-809 Poznań"]
[null,"Miejska Pracownia Urbanistyczna","ul. Prusa 3","60-819 Poznań",442,1,1,null,null,491,"Estrada Poznańska","ul. Masztalarska 8","61-767 Poznań"]
[null,"Palmiarnia Poznańska","ul. Matejki 18","60-767 Poznań",424,1,1,null,null,495,"Galeria Miejska \"Arsenał\"","Stary Rynek 3","61-722 Poznań"]
[null,"Urząd Miasta Poznania","Plac Kolegiacki 17","61-841 Poznań",163,1,1,null,null,499,"Muzeum Archeologiczne w Poznaniu","ul. Wodna 27","61-781 Poznań"]
[null,"Usługi Komunalne","ul. Słowackiego 43","60-521 Poznań",427,1,1,null,null,496,"Dom Kultury \"Stokrotka\"","ul. Cyniowa 11","60-175 Poznań"]
[null,"Zarząd Dróg Miejskich","ul. Wilczak 16","61-623 Poznań",428,1,1,null,null,33693,"Poznański Chór Chłopięcy","ul. Cegielskiego 1","61-862 Poznań"]
[null,"Zarząd Geodezji i Katastru Miejskiego GEOPOZ","ul. Gronowa 20","61-655 Poznań",426,1,1,null,null,489,"Teatr Animacji w Poznaniu","Aleja Niepodległości 14","61-713 Poznań"]
[null,"Zarząd Zieleni Miejskiej","ul. Strzegomska 3","60-194 Poznań",432,1,1,null,null,488,"Teatr Muzyczny w Poznaniu","ul. Niezłomnych 1e","61-894 Poznań"]
[null,"Zarząd Transportu Miejskiego","ul.Grunwaldzka 104","60-307 Poznań",36312,1,1,null,null,490,"Teatr Ósmego Dnia","ul. Ratajczaka 44","61-728 Poznań"]
[null,"Ogród Zoologiczny","ul. Browarna 25","61-063 Poznań",430,1,1,null,null,492,"Teatr Polski w Poznaniu","ul. 27 Grudnia 8/10","61-737 Poznań"]
[null,"Szkoła Podstawowa - Piątkowska Szkoła Uspołeczniona","ul. Stróżyńskiego 16","60-688 Poznań",30379,1,2,1,null,494,"Wielkopolskie Muzeum Walk Niepodległościowych","ul. Woźna 12","61-777 Poznań"]
[null,"Szkoła Podstawowa Nr 3","os. Piastowskie 27","61-149 Poznań",30397,1,2,1]
[null,"Szkoła Podstawowa Nr 4","ul. Rawicka 12/14","60-113 Poznań",30022,1,2,1]
[null,"Szkoła Podstawowa Nr 5","ul. Traugutta 42","61-514 Poznań",30413,1,2,1]
[null,"Szkoła Podstawowa Nr 6 z Oddziałami Integracyjnymi","os. Rusa 56","61-254 Poznań",30023,1,2,1]
[null,"Szkoła Podstawowa Nr 7","ul. Galileusza 14","60-158 Poznań",30429,1,2,1]
[null,"Szkoła Podstawowa Nr 9","ul. Łukasiewicza 9/13","60-726 Poznań",30324,1,2,1]
[null,"Szkoła Podstawowa Nr 10","ul. Bosa 9","60-125  Poznań",30380,1,2,1]
[null,"Szkoła Podstawowa Nr 11","os. Wichrowe Wzgórze 119","61-699  Poznań",30024,1,2,1]
[null,"Szkoła Podstawowa Nr 15","os. Jana III Sobieskiego 105","60-688 Poznań",505,1,2,1]
[null,"Szkoła Podstawowa Nr 17","os. Bolesława Chrobrego 105","60-681 Poznań",30385,1,2,1]
[null,"Szkoła Podstawowa Nr 18","os. Armii Krajowej 100","61-381 Poznań",30386,1,2,1]
[null,"Szkoła Podstawowa Nr 19","os. Oświecenia 1","61-205 Poznań",30387,1,2,1]
[null,"Szkoła Podstawowa Nr 20","os. Rzeczypospolitej 44","61-395 Poznań",30388,1,2,1]
[null,"Szkoła Podstawowa Nr 21","ul. Łozowa 77","61-448 Poznań",30389,1,2,1]
[null,"Szkoła Podstawowa Nr 23","ul. Norwida 21","60-867 Poznań",30391,1,2,1]
[null,"Szkoła Podstawowa Nr 26","ul. Berwińskiego 2/4","60-765 Poznań",30394,1,2,1]
{"$rows_left_out":347}
{"sheet":"legenda","index":8,"n_rows":14,"n_cols":11,"rows_kept":14,"cut":false,"hidden":true,"merged":[]}
[null,null,null,null,null,null,null,null,null,null,"Standard"]
[null,null,null,null,null,null,null,null,null,null,"Formatting"]
[null,null,null,null,null,null,null,null,null,null,"Visual Basic"]
[]
[]
[]
[]
[]
[null,null,"Błąd uruchomienia ankiety :"]
[null,null,"Dokument został otwarty z wyłączoną opcją uruchamiania makr !"]
[]
[null,null,"Poprawne zarejestrowanie ankiety wymaga uruchomienia makra."]
[null,null,"Zamknij i ponownie otwórz ten dokument,"]
[null,null," wybierając opcję 'Włącz makra'"]